Reaction Details
TargetRetinoic acid receptor beta
LigandBDBM31892
Substrate/Competitorn/a
Meas. Tech.ChEBML_195796
EC50 22±n/a nM
Citation Jong, LLehmann, JMHobbs, PDHarlev, EHuffman, JCPfahl, MDawson, MI Conformational effects on retinoid receptor selectivity. 1. Effect of 9-double bond geometry on retinoid X receptor activity. J Med Chem36:2605-13 (1993) Retinoic acid receptor beta
Name:Retinoic acid receptor beta
Type:PROTEIN
Mol. Mass.:50498.70
Organism:Homo sapiens (Human)
Description:ChEMBL_1458015
Residue:455
BDBM31892
NameBDBM31892
Synonyms:9-cis retinoic acid CHEMBL705 alitretinoin
TypeSmall organic molecule
Emp. Form.C20H28O2
Mol. Mass.300.4351
SMILESC\C(\C=C\C1=C(C)CCCC1(C)C)=C\C=C\C(\C)=C\C(O)=O