Reaction Details
TargetCathepsin D
LigandBDBM50045285
Substrate/Competitorn/a
Meas. Tech.ChEBML_45168
Ki 0.600000±n/a nM
Citation Rao, CMScarborough, PEKay, JBatley, BRapundalo, SKlutchko, STaylor, MDLunney, EAHumblet, CCDunn, BM Specificity in the binding of inhibitors to the active site of human/primate aspartic proteinases: analysis of P2-P1-P1'-P2' variation. J Med Chem36:2614-20 (1993) Cathepsin D
Name:Cathepsin D
Type:Enzyme
Mol. Mass.:44551.72
Organism:Homo sapiens (Human)
Description:Human proCathepsin D (SwissProt accession number P07339) was expressed in Sf9 cells, purified, and autoactivated.
Residue:412
BDBM50045285
NameBDBM50045285
Synonyms:2-[2-(Morpholine-4-sulfonylamino)-3-phenyl-propionylamino]-pent-4-enoic acid (1-cyclohexylmethyl-4-[1,3]dithian-2-yl-2,4-dihydroxy-butyl)-amide | CHEMBL87025
TypeSmall organic molecule
Emp. Form.C33H52N4O7S3
Mol. Mass.712.984
SMILESO[C@@H](C[C@H](O)C1SCCCS1)[C@H](CC1CCCCC1)NC(=O)[C@H](CC=C)NC(=O)[C@H](Cc1ccccc1)NS(=O)(=O)N1CCOCC1