Reaction Details
TargetCathepsin E
LigandBDBM50045281
Substrate/Competitorn/a
Meas. Tech.ChEBML_45334
Ki 2±n/a nM
Citation Rao, CMScarborough, PEKay, JBatley, BRapundalo, SKlutchko, STaylor, MDLunney, EAHumblet, CCDunn, BM Specificity in the binding of inhibitors to the active site of human/primate aspartic proteinases: analysis of P2-P1-P1'-P2' variation. J Med Chem36:2614-20 (1993) Cathepsin E
Name:Cathepsin E
Type:Enzyme
Mol. Mass.:43298.99
Organism:Homo sapiens (Human)
Description:P14091
Residue:396
BDBM50045281
NameBDBM50045281
Synonyms:2-[2-(Morpholine-4-sulfonylamino)-3-phenyl-propionylamino]-pent-4-enoic acid (1-cyclohexylmethyl-2,4-dihydroxy-5-methyl-hexyl)-amide | CHEMBL84970
TypeSmall organic molecule
Emp. Form.C32H52N4O7S
Mol. Mass.636.843
SMILESCC(C)[C@@H](O)C[C@H](O)[C@H](CC1CCCCC1)NC(=O)[C@H](CC=C)NC(=O)[C@H](Cc1ccccc1)NS(=O)(=O)N1CCOCC1