Reaction Details
TargetCathepsin D
LigandBDBM50045290
Substrate/Competitorn/a
Meas. Tech.ChEBML_45168
Ki 0.400000±n/a nM
Citation Rao, CMScarborough, PEKay, JBatley, BRapundalo, SKlutchko, STaylor, MDLunney, EAHumblet, CCDunn, BM Specificity in the binding of inhibitors to the active site of human/primate aspartic proteinases: analysis of P2-P1-P1'-P2' variation. J Med Chem36:2614-20 (1993) Cathepsin D
Name:Cathepsin D
Type:Enzyme
Mol. Mass.:44551.72
Organism:Homo sapiens (Human)
Description:Human proCathepsin D (SwissProt accession number P07339) was expressed in Sf9 cells, purified, and autoactivated.
Residue:412
BDBM50045290
NameBDBM50045290
Synonyms:2-[2-(Morpholine-4-sulfonylamino)-3-phenyl-propionylamino]-pent-4-enoic acid [1-cyclohexylmethyl-3,3-difluoro-3-(2-methyl-butylcarbamoyl)-2-oxo-propyl]-amide | CHEMBL88415
TypeSmall organic molecule
Emp. Form.C34H51F2N5O7S
Mol. Mass.711.86
SMILESCC[C@H](C)CNC(=O)C(F)(F)C(=O)[C@H](CC1CCCCC1)NC(=O)[C@H](CC=C)NC(=O)[C@H](Cc1ccccc1)NS(=O)(=O)N1CCOCC1