Reaction Details
TargetLeukotriene B4 receptor 1
LigandBDBM50037382
Substrate/Competitorn/a
Meas. Tech.ChEMBL_99827 (CHEMBL709857)
Ki 4±n/a nM
Citation Daines, RAChambers, PAPendrak, IJakas, DRSarau, HMFoley, JJSchmidt, DBGriswold, DEMartin, LDTzimas, MN (E)-3-[[[[6-(2-carboxyethenyl)-5-[[8-(4- methoxyphenyl)octyl]oxy]-2-pyridinyl]-methyl]thio]methyl]benzoic acid: a novel high-affinity leukotriene B4 receptor antagonist. J Med Chem36:2703-5 (1993) Leukotriene B4 receptor 1
Name:Leukotriene B4 receptor 1
Type:Enzyme Catalytic Domain
Mol. Mass.:37582.68
Organism:Homo sapiens (Human)
Description:Q15722
Residue:352
BDBM50037382
NameBDBM50037382
Synonyms:5-{2-(2-Carboxy-ethyl)-3-[(E)-6-(4-methoxy-phenyl)-hex-5-enyloxy]-phenoxy}-pentanoic acid CHEMBL422420 ONO-4057
TypeSmall organic molecule
Emp. Form.C27H34O7
Mol. Mass.470.5547
SMILESCOc1ccc(\C=C\CCCCOc2cccc(OCCCCC(O)=O)c2CCC(O)=O)cc1