Reaction Details
TargetLeukotriene B4 receptor 1
LigandBDBM50037385
Substrate/Competitorn/a
Meas. Tech.ChEMBL_99826 (CHEMBL709856)
Ki 7.1±n/a nM
Citation Daines, RAChambers, PAPendrak, IJakas, DRSarau, HMFoley, JJSchmidt, DBGriswold, DEMartin, LDTzimas, MN (E)-3-[[[[6-(2-carboxyethenyl)-5-[[8-(4- methoxyphenyl)octyl]oxy]-2-pyridinyl]-methyl]thio]methyl]benzoic acid: a novel high-affinity leukotriene B4 receptor antagonist. J Med Chem36:2703-5 (1993) Leukotriene B4 receptor 1
Name:Leukotriene B4 receptor 1
Type:Enzyme Catalytic Domain
Mol. Mass.:37582.68
Organism:Homo sapiens (Human)
Description:Q15722
Residue:352
BDBM50037385
NameBDBM50037385
Synonyms:3-{6-((E)-2-Carboxy-vinyl)-5-[6-(4-methoxy-phenyl)-hexyloxy]-pyridin-2-ylmethylsulfanylmethyl}-benzoic acid 3-{6-(2-Carboxy-vinyl)-5-[8-(4-methoxy-phenyl)-octyloxy]-pyridin-2-ylmethylsulfanylmethyl}-benzoic acid (SB201993) SB-201993
TypeSmall organic molecule
Emp. Form.C32H37NO6S
Mol. Mass.563.704
SMILESCOc1ccc(CCCCCCCCOc2ccc(CSCc3cccc(c3)C(O)=O)nc2\C=C\C(O)=O)cc1