Reaction Details
Target5-hydroxytryptamine receptor 1A
LigandBDBM50039822
Substrate/Competitorn/a
Meas. Tech.ChEBML_1193
Ki 0.250000±n/a nM
Citation van Steen, BJvan Wijngaarden, ITulp, MTSoudijn, W Structure-affinity relationship studies on 5-HT1A receptor ligands. 1. Heterobicyclic phenylpiperazines with N4-alkyl substituents. J Med Chem36:2751-60 (1993) 5-hydroxytryptamine receptor 1A
Name:5-hydroxytryptamine receptor 1A
Type:G Protein-Coupled Receptor (GPCR)
Mol. Mass.:46445.29
Organism:Rattus norvegicus (rat)
Description:Binding assays were performed using rat hippocampal membranes.
Residue:422
BDBM50039822
NameBDBM50039822
Synonyms:1-(2-Cyclohexyl-ethyl)-4-(2,3-dihydro-benzo[1,4]dioxin-5-yl)-piperazine; hydrochloride CHEMBL543851
TypeSmall organic molecule
Emp. Form.C20H30N2O2
Mol. Mass.330.4644
SMILESC(CN1CCN(CC1)c1cccc2OCCOc12)C1CCCCC1