Reaction Details
Target5-hydroxytryptamine receptor 1A
LigandBDBM50039819
Substrate/Competitorn/a
Meas. Tech.ChEBML_1193
Ki 0.500000±n/a nM
Citation van Steen, BJvan Wijngaarden, ITulp, MTSoudijn, W Structure-affinity relationship studies on 5-HT1A receptor ligands. 1. Heterobicyclic phenylpiperazines with N4-alkyl substituents. J Med Chem36:2751-60 (1993) 5-hydroxytryptamine receptor 1A
Name:5-hydroxytryptamine receptor 1A
Type:G Protein-Coupled Receptor (GPCR)
Mol. Mass.:46445.29
Organism:Rattus norvegicus (rat)
Description:Binding assays were performed using rat hippocampal membranes.
Residue:422
BDBM50039819
NameBDBM50039819
Synonyms:1-(2,3-Dihydro-benzo[1,4]dioxin-5-yl)-4-hexyl-piperazine | CHEMBL27457
TypeSmall organic molecule
Emp. Form.C18H28N2O2
Mol. Mass.304.4271
SMILESCCCCCCN1CCN(CC1)c1cccc2OCCOc12