Reaction Details
TargetPolyunsaturated fatty acid 5-lipoxygenase
LigandBDBM50045654
Substrate/Competitorn/a
Meas. Tech.ChEBML_3830
IC50 11±n/a nM
Citation Hutchinson, JHRiendeau, DBrideau, CChan, CDelorme, DDenis, DFalgueyret, JPFortin, RGuay, JHamel, P Substituted thiopyrano[2,3,4-c,d]indoles as potent, selective, and orally active inhibitors of 5-lipoxygenase. Synthesis and biological evaluation of L-691,816. J Med Chem36:2771-87 (1993) Polyunsaturated fatty acid 5-lipoxygenase
Name:Polyunsaturated fatty acid 5-lipoxygenase
Type:Enzyme
Mol. Mass.:77972.74
Organism:Homo sapiens (Human)
Description:Recombinant protein was purified from E. coli lysate. After ammonium sulfate precipitation and subsequent steps, the supernatant (S100) was used for 5-LO activity assay.
Residue:674
BDBM50045654
NameBDBM50045654
Synonyms:CHEMBL96253 | N-{4-[1-(4-Chloro-benzyl)-4-methyl-6-(5-phenyl-pyridin-2-ylmethoxy)-4,5-dihydro-1H-3-thia-1-aza-acenaphthylen-2-yl]-3,3-dimethyl-butyryl}-methanesulfonamide
TypeSmall organic molecule
Emp. Form.C37H38ClN3O4S2
Mol. Mass.688.298
SMILESCC1Cc2c(OCc3ccc(cn3)-c3ccccc3)ccc3n(Cc4ccc(Cl)cc4)c(CC(C)(C)CC(=O)NS(C)(=O)=O)c(S1)c23