Reaction Details
TargetMu-type opioid receptor
LigandBDBM50045764
Substrate/Competitorn/a
Meas. Tech.ChEBML_222070
Ki 0.950000±n/a nM
Citation Zimmerman, DMLeander, JDCantrell, BEReel, JKSnoddy, JMendelsohn, LGJohnson, BGMitch, CH Structure-activity relationships of trans-3,4-dimethyl-4-(3-hydroxyphenyl)piperidine antagonists for mu- and kappa-opioid receptors. J Med Chem36:2833-41 (1993) Mu-type opioid receptor
Name:Mu-type opioid receptor
Type:G Protein-Coupled Receptor (GPCR)
Mol. Mass.:44503.11
Organism:Rattus norvegicus (rat)
Description:Competition binding assays were carried out using membrane preparations from transfected HN9.10 cells that constitutively expressed the mu opioid receptor.
Residue:398
BDBM50045764
NameBDBM50045764
Synonyms:3-{1-[3-(2-Methoxy-phenyl)-propyl]-3,4-dimethyl-piperidin-4-yl}-phenol | CHEMBL97516
TypeSmall organic molecule
Emp. Form.C23H31NO2
Mol. Mass.353.4977
SMILESCOc1ccccc1CCCN1CC[C@](C)([C@@H](C)C1)c1cccc(O)c1