Reaction Details
TargetKappa-type opioid receptor
LigandBDBM50045782
Substrate/Competitorn/a
Meas. Tech.ChEBML_220942
Ki 1±n/a nM
Citation Mitch, CHLeander, JDMendelsohn, LGShaw, WNWong, DTCantrell, BEJohnson, BGReel, JKSnoddy, JDTakemori, AE 3,4-Dimethyl-4-(3-hydroxyphenyl)piperidines: opioid antagonists with potent anorectant activity. J Med Chem36:2842-50 (1993) Kappa-type opioid receptor
Name:Kappa-type opioid receptor
Type:G Protein-Coupled Receptor (GPCR)
Mol. Mass.:42744.99
Organism:Cavia porcellus (domestic guinea pig)
Description:P41144
Residue:380
BDBM50045782
NameBDBM50045782
Synonyms:3-[1-(2-Cyclopent-2-enyl-ethyl)-3,4-dimethyl-piperidin-4-yl]-phenol | CHEMBL317936
TypeSmall organic molecule
Emp. Form.C20H29NO
Mol. Mass.299.4504
SMILESC[C@H]1CN(CCC2CCC=C2)CC[C@@]1(C)c1cccc(O)c1