Reaction Details
TargetMu-type opioid receptor
LigandBDBM50045770
Substrate/Competitorn/a
Meas. Tech.ChEMBL_220391 (CHEMBL843233)
Ki 0.620000±n/a nM
Citation Mitch, CHLeander, JDMendelsohn, LGShaw, WNWong, DTCantrell, BEJohnson, BGReel, JKSnoddy, JDTakemori, AE 3,4-Dimethyl-4-(3-hydroxyphenyl)piperidines: opioid antagonists with potent anorectant activity. J Med Chem36:2842-50 (1993) Mu-type opioid receptor
Name:Mu-type opioid receptor
Type:G Protein-Coupled Receptor (GPCR)
Mol. Mass.:44503.11
Organism:Rattus norvegicus (rat)
Description:Competition binding assays were carried out using membrane preparations from transfected HN9.10 cells that constitutively expressed the mu opioid receptor.
Residue:398
BDBM50045770
NameBDBM50045770
Synonyms:3-(1-Heptyl-3,4-dimethyl-piperidin-4-yl)-phenol | CHEMBL319561
TypeSmall organic molecule
Emp. Form.C20H33NO
Mol. Mass.303.4821
SMILESCCCCCCCN1CC[C@](C)([C@@H](C)C1)c1cccc(O)c1