Reaction Details
TargetMu-type opioid receptor
LigandBDBM50045791
Substrate/Competitorn/a
Meas. Tech.ChEBML_220391
Ki 0.370000±n/a nM
Citation Mitch, CHLeander, JDMendelsohn, LGShaw, WNWong, DTCantrell, BEJohnson, BGReel, JKSnoddy, JDTakemori, AE 3,4-Dimethyl-4-(3-hydroxyphenyl)piperidines: opioid antagonists with potent anorectant activity. J Med Chem36:2842-50 (1993) Mu-type opioid receptor
Name:Mu-type opioid receptor
Type:G Protein-Coupled Receptor (GPCR)
Mol. Mass.:44503.11
Organism:Rattus norvegicus (rat)
Description:Competition binding assays were carried out using membrane preparations from transfected HN9.10 cells that constitutively expressed the mu opioid receptor.
Residue:398
BDBM50045791
NameBDBM50045791
Synonyms:3-[1-(3-Cyclopentyl-propyl)-3,4-dimethyl-piperidin-4-yl]-phenol | CHEMBL95647
TypeSmall organic molecule
Emp. Form.C21H33NO
Mol. Mass.315.4928
SMILESC[C@H]1CN(CCCC2CCCC2)CC[C@@]1(C)c1cccc(O)c1