Reaction Details
TargetGastrin/cholecystokinin type B receptor
LigandBDBM50045803
Substrate/Competitorn/a
Meas. Tech.ChEBML_49880
Ki 39±n/a nM
Citation Blommaert, AGWeng, JHDorville, AMcCort, IDucos, BDurieux, CRoques, BP Cholecystokinin peptidomimetics as selective CCK-B antagonists: design, synthesis, and in vitro and in vivo biochemical properties. J Med Chem36:2868-77 (1993) Gastrin/cholecystokinin type B receptor
Name:Gastrin/cholecystokinin type B receptor
Type:G Protein-Coupled Receptor (GPCR)
Mol. Mass.:48445.79
Organism:Homo sapiens (Human)
Description:Stable expression of human CCK-2 receptors in HEK 293 cells.
Residue:447
BDBM50045803
NameBDBM50045803
Synonyms:CHEMBL433407 | [1-[2-(4-Chloro-phenyl)-ethylcarbamoyl]-2-(1H-indol-3-yl)-1-methyl-ethyl]-carbamic acid adamantan-2-yl ester
TypeSmall organic molecule
Emp. Form.C31H36ClN3O3
Mol. Mass.534.089
SMILESCC(Cc1c[nH]c2ccccc12)(NC(=O)OC1[C@H]2C[C@@H]3C[C@@H](C[C@H]1C3)C2)C(=O)NCCc1ccc(Cl)cc1