Reaction Details
TargetGastrin/cholecystokinin type B receptor
LigandBDBM50045806
Substrate/Competitorn/a
Meas. Tech.ChEBML_49880
Ki 50±n/a nM
Citation Blommaert, AGWeng, JHDorville, AMcCort, IDucos, BDurieux, CRoques, BP Cholecystokinin peptidomimetics as selective CCK-B antagonists: design, synthesis, and in vitro and in vivo biochemical properties. J Med Chem36:2868-77 (1993) Gastrin/cholecystokinin type B receptor
Name:Gastrin/cholecystokinin type B receptor
Type:G Protein-Coupled Receptor (GPCR)
Mol. Mass.:48445.79
Organism:Homo sapiens (Human)
Description:Stable expression of human CCK-2 receptors in HEK 293 cells.
Residue:447
BDBM50045806
NameBDBM50045806
Synonyms:CHEMBL320399 | {[2-(Adamantan-2-yloxycarbonylamino)-3-(4-bromo-phenyl)-2-methyl-propionyl]-phenethyl-amino}-acetic acid
TypeSmall organic molecule
Emp. Form.C31H37BrN2O5
Mol. Mass.597.54
SMILESCC(Cc1ccc(Br)cc1)(NC(=O)OC1[C@H]2C[C@@H]3C[C@@H](C[C@H]1C3)C2)C(=O)N(CCc1ccccc1)CC(O)=O