Reaction Details
TargetGastrin/cholecystokinin type B receptor
LigandBDBM50045804
Substrate/Competitorn/a
Meas. Tech.ChEBML_49880
Ki 115±n/a nM
Citation Blommaert, AGWeng, JHDorville, AMcCort, IDucos, BDurieux, CRoques, BP Cholecystokinin peptidomimetics as selective CCK-B antagonists: design, synthesis, and in vitro and in vivo biochemical properties. J Med Chem36:2868-77 (1993) Gastrin/cholecystokinin type B receptor
Name:Gastrin/cholecystokinin type B receptor
Type:G Protein-Coupled Receptor (GPCR)
Mol. Mass.:48445.79
Organism:Homo sapiens (Human)
Description:Stable expression of human CCK-2 receptors in HEK 293 cells.
Residue:447
BDBM50045804
NameBDBM50045804
Synonyms:CHEMBL329088 | {2-(1H-Indol-3-yl)-1-[2-(4-methoxy-phenyl)-ethylcarbamoyl]-1-methyl-ethyl}-carbamic acid adamantan-2-yl ester
TypeSmall organic molecule
Emp. Form.C32H39N3O4
Mol. Mass.529.6698
SMILESCOc1ccc(CCNC(=O)C(C)(Cc2c[nH]c3ccccc23)NC(=O)OC2[C@H]3C[C@@H]4C[C@@H](C[C@H]2C4)C3)cc1