Reaction Details
TargetD(1A) dopamine receptor
LigandBDBM50045822
Substrate/Competitorn/a
Meas. Tech.ChEBML_58181
IC50 12±n/a nM
Citation Palm, JBøgesø, KPLiljefors, T A structure-activity study of four dopamine D-1 and D-2 receptor antagonists, representing the phenylindan, -indene, and -indole structural classes of compounds. J Med Chem36:2878-85 (1993) D(1A) dopamine receptor
Name:D(1A) dopamine receptor
Type:Enzyme Catalytic Domain
Mol. Mass.:49429.75
Organism:RAT
Description:P18901
Residue:446
BDBM50045822
NameBDBM50045822
Synonyms:4-[6-Chloro-3-(4-fluoro-phenyl)-3H-inden-1-yl]-1-methyl-piperidine | CHEMBL317982
TypeSmall organic molecule
Emp. Form.C21H21ClFN
Mol. Mass.341.85
SMILESCN1CCC(CC1)C1=CC(c2ccc(Cl)cc12)c1ccc(F)cc1