Reaction Details
TargetTranslocator protein
LigandBDBM50045881
Substrate/Competitorn/a
Meas. Tech.ChEBML_218704
Ki 476.0±n/a nM
Citation Kozikowski, APMa, DBrewer, JSun, SCosta, ERomeo, EGuidotti, A Chemistry, binding affinities, and behavioral properties of a new class of"antineophobic" mitochondrial DBI receptor complex (mDRC) ligands. J Med Chem36:2908-20 (1993) Translocator protein
Name:Translocator protein
Type:Mitochondrion membrane protein
Mol. Mass.:18945.84
Organism:Rattus norvegicus (rat)
Description:Competitive binding experiments were performed on rat kidney mitochondrial membranes.
Residue:169
BDBM50045881
NameBDBM50045881
Synonyms:CHEMBL98382 | N-(2-Bromo-phenyl)-2-[2-(4-fluoro-phenyl)-1H-indol-3-yl]-acetamide
TypeSmall organic molecule
Emp. Form.C22H16BrFN2O
Mol. Mass.423.278
SMILESFc1ccc(cc1)-c1[nH]c2ccccc2c1CC(=O)Nc1ccccc1Br