Reaction Details
TargetTranslocator protein
LigandBDBM50045891
Substrate/Competitorn/a
Meas. Tech.ChEBML_218704
Ki 800±n/a nM
Citation Kozikowski, APMa, DBrewer, JSun, SCosta, ERomeo, EGuidotti, A Chemistry, binding affinities, and behavioral properties of a new class of"antineophobic" mitochondrial DBI receptor complex (mDRC) ligands. J Med Chem36:2908-20 (1993) Translocator protein
Name:Translocator protein
Type:Mitochondrion membrane protein
Mol. Mass.:18945.84
Organism:Rattus norvegicus (rat)
Description:Competitive binding experiments were performed on rat kidney mitochondrial membranes.
Residue:169
BDBM50045891
NameBDBM50045891
Synonyms:2-[2-(4-Chloro-phenyl)-1H-indol-3-yl]-N,N-dipropyl-propionamide | CHEMBL98809
TypeSmall organic molecule
Emp. Form.C23H27ClN2O
Mol. Mass.382.926
SMILESCCCN(CCC)C(=O)C(C)c1c([nH]c2ccccc12)-c1ccc(Cl)cc1