Reaction Details
TargetTranslocator protein
LigandBDBM50045880
Substrate/Competitorn/a
Meas. Tech.ChEBML_218704
Ki 3.9±n/a nM
Citation Kozikowski, APMa, DBrewer, JSun, SCosta, ERomeo, EGuidotti, A Chemistry, binding affinities, and behavioral properties of a new class of"antineophobic" mitochondrial DBI receptor complex (mDRC) ligands. J Med Chem36:2908-20 (1993) Translocator protein
Name:Translocator protein
Type:Mitochondrion membrane protein
Mol. Mass.:18945.84
Organism:Rattus norvegicus (rat)
Description:Competitive binding experiments were performed on rat kidney mitochondrial membranes.
Residue:169
BDBM50045880
NameBDBM50045880
Synonyms:2-[5-Chloro-2-(4-chloro-phenyl)-1H-indol-3-yl]-N,N-dipropyl-acetamide | CHEMBL97269
TypeSmall organic molecule
Emp. Form.C22H24Cl2N2O
Mol. Mass.403.345
SMILESCCCN(CCC)C(=O)Cc1c([nH]c2ccc(Cl)cc12)-c1ccc(Cl)cc1