Reaction Details
TargetTranslocator protein
LigandBDBM50045894
Substrate/Competitorn/a
Meas. Tech.ChEBML_218704
Ki 9.7±n/a nM
Citation Kozikowski, APMa, DBrewer, JSun, SCosta, ERomeo, EGuidotti, A Chemistry, binding affinities, and behavioral properties of a new class of"antineophobic" mitochondrial DBI receptor complex (mDRC) ligands. J Med Chem36:2908-20 (1993) Translocator protein
Name:Translocator protein
Type:Mitochondrion membrane protein
Mol. Mass.:18945.84
Organism:Rattus norvegicus (rat)
Description:Competitive binding experiments were performed on rat kidney mitochondrial membranes.
Residue:169
BDBM50045894
NameBDBM50045894
Synonyms:CHEMBL98081 | N,N-Dihexyl-2-(2-phenyl-1H-indol-3-yl)-acetamide
TypeSmall organic molecule
Emp. Form.C28H38N2O
Mol. Mass.418.6141
SMILESCCCCCCN(CCCCCC)C(=O)Cc1c([nH]c2ccccc12)-c1ccccc1