Reaction Details
TargetCannabinoid receptor 1
LigandBDBM50045877
Substrate/Competitorn/a
Meas. Tech.ChEBML_46288
IC50>1000±n/a nM
Citation Kozikowski, APMa, DBrewer, JSun, SCosta, ERomeo, EGuidotti, A Chemistry, binding affinities, and behavioral properties of a new class of"antineophobic" mitochondrial DBI receptor complex (mDRC) ligands. J Med Chem36:2908-20 (1993) Cannabinoid receptor 1
Name:Cannabinoid receptor 1
Type:G Protein-Coupled Receptor (GPCR)
Mol. Mass.:52856.55
Organism:Rattus norvegicus (rat)
Description:P20272
Residue:473
BDBM50045877
NameBDBM50045877
Synonyms:2-(2-(4-fluorophenyl)-1H-indol-3-yl)-N,N-dihexylacetamide CHEMBL63154 | [N,N-di-n-hexyl-2-(4-fluorophenyl) indole-3-acetamide]
TypeSmall organic molecule
Emp. Form.C28H37FN2O
Mol. Mass.436.6046
SMILESCCCCCCN(CCCCCC)C(=O)Cc1c([nH]c2ccccc12)-c1ccc(F)cc1