Reaction Details
TargetTranslocator protein
LigandBDBM50045860
Substrate/Competitorn/a
Meas. Tech.ChEBML_218704
Ki>1000±n/a nM
Citation Kozikowski, APMa, DBrewer, JSun, SCosta, ERomeo, EGuidotti, A Chemistry, binding affinities, and behavioral properties of a new class of"antineophobic" mitochondrial DBI receptor complex (mDRC) ligands. J Med Chem36:2908-20 (1993) Translocator protein
Name:Translocator protein
Type:Mitochondrion membrane protein
Mol. Mass.:18945.84
Organism:Rattus norvegicus (rat)
Description:Competitive binding experiments were performed on rat kidney mitochondrial membranes.
Residue:169
BDBM50045860
NameBDBM50045860
Synonyms:CHEMBL327273 | N-Decyl-2-(2-phenyl-1H-indol-3-yl)-acetamide
TypeSmall organic molecule
Emp. Form.C26H34N2O
Mol. Mass.390.561
SMILESCCCCCCCCCCNC(=O)Cc1c([nH]c2ccccc12)-c1ccccc1