Reaction Details
TargetAmiloride-sensitive amine oxidase [copper-containing]
LigandBDBM50046200
Substrate/Competitorn/a
Meas. Tech.ChEBML_53893
IC50 2700±n/a nM
Citation Stanek, JCaravatti, GCapraro, HGFuret, PMett, HSchneider, PRegenass, U S-adenosylmethionine decarboxylase inhibitors: new aryl and heteroaryl analogues of methylglyoxal bis(guanylhydrazone). J Med Chem36:46-54 (1993) Amiloride-sensitive amine oxidase [copper-containing]
Name:Amiloride-sensitive amine oxidase [copper-containing]
Type:PROTEIN
Mol. Mass.:85028.72
Organism:Rattus norvegicus
Description:ChEMBL_53893
Residue:746
BDBM50046200
NameBDBM50046200
Synonyms:(2E)-2-(1-{3-[(E)-amino(imino)methyl]phenyl}ethylidene)hydrazinecarboximidamide | CHEMBL150828
TypeSmall organic molecule
Emp. Form.C10H14N6
Mol. Mass.218.2584
SMILES[#6]-[#6](=[#7]\[#7]=[#6](\[#7])-[#7])-c1cccc(c1)-[#6](-[#7])=[#7]