Reaction Details
TargetAmiloride-sensitive amine oxidase [copper-containing]
LigandBDBM50046203
Substrate/Competitorn/a
Meas. Tech.ChEBML_53893
IC50 870.0±n/a nM
Citation Stanek, JCaravatti, GCapraro, HGFuret, PMett, HSchneider, PRegenass, U S-adenosylmethionine decarboxylase inhibitors: new aryl and heteroaryl analogues of methylglyoxal bis(guanylhydrazone). J Med Chem36:46-54 (1993) Amiloride-sensitive amine oxidase [copper-containing]
Name:Amiloride-sensitive amine oxidase [copper-containing]
Type:PROTEIN
Mol. Mass.:85028.72
Organism:Rattus norvegicus
Description:ChEMBL_53893
Residue:746
BDBM50046203
NameBDBM50046203
Synonyms:3-((E)-{[(E)-amino(hydrazono)methyl]hydrazono}methyl)benzenecarboximidamide | CHEMBL151654
TypeSmall organic molecule
Emp. Form.C9H13N7
Mol. Mass.219.2464
SMILESNC(=N)c1cccc(CNN=C(N)N=N)c1