Reaction Details
TargetAmiloride-sensitive amine oxidase [copper-containing]
LigandBDBM50046201
Substrate/Competitorn/a
Meas. Tech.ChEBML_53893
IC50 1500±n/a nM
Citation Stanek, JCaravatti, GCapraro, HGFuret, PMett, HSchneider, PRegenass, U S-adenosylmethionine decarboxylase inhibitors: new aryl and heteroaryl analogues of methylglyoxal bis(guanylhydrazone). J Med Chem36:46-54 (1993) Amiloride-sensitive amine oxidase [copper-containing]
Name:Amiloride-sensitive amine oxidase [copper-containing]
Type:PROTEIN
Mol. Mass.:85028.72
Organism:Rattus norvegicus
Description:ChEMBL_53893
Residue:746
BDBM50046201
NameBDBM50046201
Synonyms:(2E)-2-((2E)-2-{[(E)-amino(imino)methyl]hydrazono}-1-methylethylidene)hydrazinecarboximidamide CHEMBL216913 Mitoguazone methylglyoxalbisguanylhydrazone
TypeSmall organic molecule
Emp. Form.C5H12N8
Mol. Mass.184.2024
SMILES[#6]-[#6](-[#6]=[#7]-[#7]-[#6](-[#7])=[#7])=[#7]\[#7]=[#6](\[#7])-[#7]