Reaction Details
TargetAmiloride-sensitive amine oxidase [copper-containing]
LigandBDBM50046192
Substrate/Competitorn/a
Meas. Tech.ChEBML_53893
IC50 1660±n/a nM
Citation Stanek, JCaravatti, GCapraro, HGFuret, PMett, HSchneider, PRegenass, U S-adenosylmethionine decarboxylase inhibitors: new aryl and heteroaryl analogues of methylglyoxal bis(guanylhydrazone). J Med Chem36:46-54 (1993) Amiloride-sensitive amine oxidase [copper-containing]
Name:Amiloride-sensitive amine oxidase [copper-containing]
Type:PROTEIN
Mol. Mass.:85028.72
Organism:Rattus norvegicus
Description:ChEMBL_53893
Residue:746
BDBM50046192
NameBDBM50046192
Synonyms:6-((E)-{[(E)-amino(hydrazono)methyl]hydrazono}methyl)pyridine-2-carboximidamide | CHEMBL149976
TypeSmall organic molecule
Emp. Form.C8H12N8
Mol. Mass.220.2345
SMILESNC(=N)c1cccc(CNN=C(N)N=N)n1