Reaction Details
TargetAmiloride-sensitive amine oxidase [copper-containing]
LigandBDBM50046191
Substrate/Competitorn/a
Meas. Tech.ChEBML_53893
IC50 2800±n/a nM
Citation Stanek, JCaravatti, GCapraro, HGFuret, PMett, HSchneider, PRegenass, U S-adenosylmethionine decarboxylase inhibitors: new aryl and heteroaryl analogues of methylglyoxal bis(guanylhydrazone). J Med Chem36:46-54 (1993) Amiloride-sensitive amine oxidase [copper-containing]
Name:Amiloride-sensitive amine oxidase [copper-containing]
Type:PROTEIN
Mol. Mass.:85028.72
Organism:Rattus norvegicus
Description:ChEMBL_53893
Residue:746
BDBM50046191
NameBDBM50046191
Synonyms:(2E)-2-{3-[(E)-amino(imino)methyl]benzylidene}-N'-butylhydrazinecarboximidamide | CHEMBL150931
TypeSmall organic molecule
Emp. Form.C13H20N6
Mol. Mass.260.3381
SMILESCCCCN=C(N)NN=Cc1cccc(c1)C(N)=N