Reaction Details
TargetAmiloride-sensitive amine oxidase [copper-containing]
LigandBDBM50046207
Substrate/Competitorn/a
Meas. Tech.ChEBML_53893
IC50 760±n/a nM
Citation Stanek, JCaravatti, GCapraro, HGFuret, PMett, HSchneider, PRegenass, U S-adenosylmethionine decarboxylase inhibitors: new aryl and heteroaryl analogues of methylglyoxal bis(guanylhydrazone). J Med Chem36:46-54 (1993) Amiloride-sensitive amine oxidase [copper-containing]
Name:Amiloride-sensitive amine oxidase [copper-containing]
Type:PROTEIN
Mol. Mass.:85028.72
Organism:Rattus norvegicus
Description:ChEMBL_53893
Residue:746
BDBM50046207
NameBDBM50046207
Synonyms:6-((E)-{[(E)-[(2E)-2-({6-[(E)-amino(imino)methyl]pyridin-2-yl}methylene)hydrazino](imino)methyl]hydrazono}methyl)pyridine-2-carboximidamide | CHEMBL151001
TypeSmall organic molecule
Emp. Form.C15H17N11
Mol. Mass.351.3692
SMILESNC(=N)c1cccc(C=NNC(=N)NN=Cc2cccc(n2)C(N)=N)n1