Reaction Details
TargetPurine nucleoside phosphorylase
LigandBDBM50046235
Substrate/Competitorn/a
Meas. Tech.ChEBML_153325
IC50 48±n/a nM
Citation Montgomery, JANiwas, SRose, JDSecrist, JABabu, YSBugg, CEErion, MDGuida, WCEalick, SE Structure-based design of inhibitors of purine nucleoside phosphorylase. 1. 9-(arylmethyl) derivatives of 9-deazaguanine. J Med Chem36:55-69 (1993) Purine nucleoside phosphorylase
Name:Purine nucleoside phosphorylase
Type:Enzyme
Mol. Mass.:32119.53
Organism:Homo sapiens (Human)
Description:n/a
Residue:289
BDBM50046235
NameBDBM50046235
Synonyms:2-Amino-8-(3-methyl-thiophen-2-ylmethyl)-1,9-dihydro-purin-6-one | CHEMBL159556
TypeSmall organic molecule
Emp. Form.C11H11N5OS
Mol. Mass.261.303
SMILESCc1ccsc1Cc1nc2nc(N)[nH]c(=O)c2[nH]1