Reaction Details
TargetPurine nucleoside phosphorylase
LigandBDBM50046251
Substrate/Competitorn/a
Meas. Tech.ChEBML_153325
IC50 0.470000±n/a nM
Citation Montgomery, JANiwas, SRose, JDSecrist, JABabu, YSBugg, CEErion, MDGuida, WCEalick, SE Structure-based design of inhibitors of purine nucleoside phosphorylase. 1. 9-(arylmethyl) derivatives of 9-deazaguanine. J Med Chem36:55-69 (1993) Purine nucleoside phosphorylase
Name:Purine nucleoside phosphorylase
Type:Enzyme
Mol. Mass.:32119.53
Organism:Homo sapiens (Human)
Description:n/a
Residue:289
BDBM50046251
NameBDBM50046251
Synonyms:2-Amino-8-benzylamino-1,9-dihydro-purin-6-one | CHEMBL350429
TypeSmall organic molecule
Emp. Form.C12H12N6O
Mol. Mass.256.2633
SMILESNc1nc2nc(NCc3ccccc3)[nH]c2c(=O)[nH]1