Reaction Details
TargetNeprilysin
LigandBDBM50046260
Substrate/Competitorn/a
Meas. Tech.ChEBML_140760
IC50 50±n/a nM
Citation Gomez-Monterrey, ITurcaud, SLucas, EBruetschy, LRoques, BPFournié-Zaluski, MC Exploration of neutral endopeptidase active site by a series of new thiol-containing inhibitors. J Med Chem36:87-94 (1993) Neprilysin
Name:Neprilysin
Type:Enzyme
Mol. Mass.:85570.75
Organism:Oryctolagus cuniculus (rabbit)
Description:NEP was purified to homogeneity from rabbit kidney.
Residue:750
BDBM50046260
NameBDBM50046260
Synonyms:(2-Benzyl-3-mercapto-butyrylamino)-acetic acid | CHEMBL366937
TypeSmall organic molecule
Emp. Form.C13H17NO3S
Mol. Mass.267.344
SMILESCC(S)C(Cc1ccccc1)C(=O)NCC(O)=O