Reaction Details
TargetNeprilysin
LigandBDBM50406747
Substrate/Competitorn/a
Meas. Tech.ChEBML_140760
IC50 3.6±n/a nM
Citation Gomez-Monterrey, ITurcaud, SLucas, EBruetschy, LRoques, BPFournié-Zaluski, MC Exploration of neutral endopeptidase active site by a series of new thiol-containing inhibitors. J Med Chem36:87-94 (1993) Neprilysin
Name:Neprilysin
Type:Enzyme
Mol. Mass.:85570.75
Organism:Oryctolagus cuniculus (rabbit)
Description:NEP was purified to homogeneity from rabbit kidney.
Residue:750
BDBM50406747
NameBDBM50406747
Synonyms:CHEMBL2110347
TypeSmall organic molecule
Emp. Form.C17H25NO3S
Mol. Mass.323.45
SMILESCC(C)C[C@H](S)[C@@H](Cc1ccccc1)C(=O)N[C@@H](C)C(O)=O