Reaction Details
TargetNeprilysin
LigandBDBM50046265
Substrate/Competitorn/a
Meas. Tech.ChEBML_140760
IC50 180±n/a nM
Citation Gomez-Monterrey, ITurcaud, SLucas, EBruetschy, LRoques, BPFournié-Zaluski, MC Exploration of neutral endopeptidase active site by a series of new thiol-containing inhibitors. J Med Chem36:87-94 (1993) Neprilysin
Name:Neprilysin
Type:Enzyme
Mol. Mass.:85570.75
Organism:Oryctolagus cuniculus (rabbit)
Description:NEP was purified to homogeneity from rabbit kidney.
Residue:750
BDBM50046265
NameBDBM50046265
Synonyms:2-(2-Benzyl-3-mercapto-5-phenyl-pentanoylamino)-3-(4-hydroxy-phenyl)-propionic acid | CHEMBL175110
TypeSmall organic molecule
Emp. Form.C27H29NO4S
Mol. Mass.463.588
SMILESOC(=O)C(Cc1ccc(O)cc1)NC(=O)C(Cc1ccccc1)C(S)CCc1ccccc1