Reaction Details
TargetAngiotensin-converting enzyme
LigandBDBM50046258
Substrate/Competitorn/a
Meas. Tech.ChEBML_36743
IC50 2800±n/a nM
Citation Gomez-Monterrey, ITurcaud, SLucas, EBruetschy, LRoques, BPFournié-Zaluski, MC Exploration of neutral endopeptidase active site by a series of new thiol-containing inhibitors. J Med Chem36:87-94 (1993) Angiotensin-converting enzyme
Name:Angiotensin-converting enzyme
Type:Enzyme
Mol. Mass.:149709.01
Organism:Homo sapiens (Human)
Description:n/a
Residue:1306
BDBM50046258
NameBDBM50046258
Synonyms:3-(4-Hydroxy-phenyl)-2-[2-(3-mercapto-5-methyl-hexanoylamino)-3-phenyl-propionylamino]-propionic acid CHEMBL367174
TypeSmall organic molecule
Emp. Form.C25H32N2O5S
Mol. Mass.472.597
SMILESCC(C)CC(S)CC(=O)NC(Cc1ccccc1)C(=O)NC(Cc1ccc(O)cc1)C(O)=O