Reaction Details
TargetAngiotensin-converting enzyme
LigandBDBM50046259
Substrate/Competitorn/a
Meas. Tech.ChEBML_36743
IC50 1300±n/a nM
Citation Gomez-Monterrey, ITurcaud, SLucas, EBruetschy, LRoques, BPFournié-Zaluski, MC Exploration of neutral endopeptidase active site by a series of new thiol-containing inhibitors. J Med Chem36:87-94 (1993) Angiotensin-converting enzyme
Name:Angiotensin-converting enzyme
Type:Enzyme
Mol. Mass.:149709.01
Organism:Homo sapiens (Human)
Description:n/a
Residue:1306
BDBM50046259
NameBDBM50046259
Synonyms:2-[2-(2-Benzyl-3-mercapto-butyrylamino)-3-methyl-butyrylamino]-3-(4-hydroxy-phenyl)-propionic acid | CHEMBL176960
TypeSmall organic molecule
Emp. Form.C25H32N2O5S
Mol. Mass.472.597
SMILESCC(C)C(NC(=O)C(Cc1ccccc1)C(C)S)C(=O)NC(Cc1ccc(O)cc1)C(O)=O