Reaction Details
TargetCytosol aminopeptidase
LigandBDBM50046314
Substrate/Competitorn/a
Meas. Tech.ChEBML_98531
IC50>100000±n/a nM
Citation Yuan, WMunoz, BWong, CHHaeggström, JZWetterholm, ASamuelsson, B Development of selective tight-binding inhibitors of leukotriene A4 hydrolase. J Med Chem36:211-20 (1993) Cytosol aminopeptidase
Name:Cytosol aminopeptidase
Type:PROTEIN
Mol. Mass.:56171.75
Organism:Homo sapiens (Human)
Description:ChEMBL_1507539
Residue:519
BDBM50046314
NameBDBM50046314
Synonyms:3-Amino-4-(4-benzyloxy-phenyl)-2-oxo-butyric acid benzyl ester | CHEMBL71535
TypeSmall organic molecule
Emp. Form.C24H23NO4
Mol. Mass.389.4437
SMILESN[C@@H](Cc1ccc(OCc2ccccc2)cc1)C(=O)C(=O)OCc1ccccc1