Reaction Details
TargetLeukotriene A-4 hydrolase
LigandBDBM50046331
Substrate/Competitorn/a
Meas. Tech.ChEMBL_96944 (CHEMBL706184)
Ki 15000±n/a nM
Citation Yuan, WMunoz, BWong, CHHaeggström, JZWetterholm, ASamuelsson, B Development of selective tight-binding inhibitors of leukotriene A4 hydrolase. J Med Chem36:211-20 (1993) Leukotriene A-4 hydrolase
Name:Leukotriene A-4 hydrolase
Type:Hydrolase; metalloprotease
Mol. Mass.:69280.41
Organism:Homo sapiens (Human)
Description:Human recombinant LTA4H.
Residue:611
BDBM50046331
NameBDBM50046331
Synonyms:((2S,3S)-3-Amino-2-hydroxy-4-phenyl-butyrylamino)-acetic acid CHEMBL306868
TypeSmall organic molecule
Emp. Form.C12H16N2O4
Mol. Mass.252.2664
SMILESN[C@@H](Cc1ccccc1)[C@H](O)C(=O)NCC(O)=O