Reaction Details
TargetBifunctional epoxide hydrolase 2
LigandBDBM50046316
Substrate/Competitorn/a
Meas. Tech.ChEBML_67382
Ki 100±n/a nM
Citation Yuan, WMunoz, BWong, CHHaeggström, JZWetterholm, ASamuelsson, B Development of selective tight-binding inhibitors of leukotriene A4 hydrolase. J Med Chem36:211-20 (1993) Bifunctional epoxide hydrolase 2
Name:Bifunctional epoxide hydrolase 2
Type:Enzyme
Mol. Mass.:62512.06
Organism:Mus musculus (Mouse)
Description:P34914
Residue:554
BDBM50046316
NameBDBM50046316
Synonyms:2-Amino-3-(4-benzyloxy-phenyl)-propane-1-thiol | CHEMBL444791
TypeSmall organic molecule
Emp. Form.C16H19NOS
Mol. Mass.273.393
SMILESN[C@H](CS)Cc1ccc(OCc2ccccc2)cc1