Reaction Details
TargetProthrombin
LigandBDBM50046343
Substrate/Competitorn/a
Meas. Tech.ChEMBL_207947 (CHEMBL811063)
EC50 390±n/a nM
Citation Balasubramanian, NSt Laurent, DRFederici, MEMeanwell, NAWright, JJSchumacher, WASeiler, SM Active site-directed synthetic thrombin inhibitors: synthesis, in vitro and in vivo activity profile of BMY 44621 and analogs. An examination of the role of the amino group in the D-Phe-Pro-Arg-H series. J Med Chem36:300-3 (1993) Prothrombin
Name:Prothrombin
Type:Protein
Mol. Mass.:70029.57
Organism:Homo sapiens (Human)
Description:P00734
Residue:622
BDBM50046343
NameBDBM50046343
Synonyms:1-(4-Oxo-4-phenyl-butyryl)-pyrrolidine-2-carboxylic acid (1-formyl-4-guanidino-butyl)-amide | CHEMBL319227
TypeSmall organic molecule
Emp. Form.C21H29N5O4
Mol. Mass.415.4861
SMILESNC(=N)NCCCC(NC(=O)C1CCCN1C(=O)C(=O)CCc1ccccc1)C=O