Reaction Details
TargetProthrombin
LigandBDBM50046347
Substrate/Competitorn/a
Meas. Tech.ChEBML_207947
EC50 590.0±n/a nM
Citation Balasubramanian, NSt Laurent, DRFederici, MEMeanwell, NAWright, JJSchumacher, WASeiler, SM Active site-directed synthetic thrombin inhibitors: synthesis, in vitro and in vivo activity profile of BMY 44621 and analogs. An examination of the role of the amino group in the D-Phe-Pro-Arg-H series. J Med Chem36:300-3 (1993) Prothrombin
Name:Prothrombin
Type:Protein
Mol. Mass.:70029.57
Organism:Homo sapiens (Human)
Description:P00734
Residue:622
BDBM50046347
NameBDBM50046347
Synonyms:1-(4-Oxo-4-thiophen-2-yl-butyryl)-pyrrolidine-2-carboxylic acid (1-formyl-4-guanidino-butyl)-amide | CHEMBL443480
TypeSmall organic molecule
Emp. Form.C19H27N5O4S
Mol. Mass.421.514
SMILESNC(=N)NCCCC(NC(=O)C1CCCN1C(=O)C(=O)CCc1ccsc1)C=O