Reaction Details
TargetProthrombin
LigandBDBM50046350
Substrate/Competitorn/a
Meas. Tech.ChEBML_207947
EC50 150±n/a nM
Citation Balasubramanian, NSt Laurent, DRFederici, MEMeanwell, NAWright, JJSchumacher, WASeiler, SM Active site-directed synthetic thrombin inhibitors: synthesis, in vitro and in vivo activity profile of BMY 44621 and analogs. An examination of the role of the amino group in the D-Phe-Pro-Arg-H series. J Med Chem36:300-3 (1993) Prothrombin
Name:Prothrombin
Type:Protein
Mol. Mass.:70029.57
Organism:Homo sapiens (Human)
Description:P00734
Residue:622
BDBM50046350
NameBDBM50046350
Synonyms:1-(4-Cyclohexyl-4-oxo-butyryl)-pyrrolidine-2-carboxylic acid (1-formyl-4-guanidino-butyl)-amide | CHEMBL317878
TypeSmall organic molecule
Emp. Form.C21H35N5O4
Mol. Mass.421.5337
SMILESNC(=N)NCCCC(NC(=O)C1CCCN1C(=O)C(=O)CCC1CCCCC1)C=O