Reaction Details
TargetProthrombin
LigandBDBM50046358
Substrate/Competitorn/a
Meas. Tech.ChEMBL_208855 (CHEMBL816690)
IC50 18±n/a nM
Citation Shuman, RTRothenberger, RBCampbell, CSSmith, GFGifford-Moore, DSGesellchen, PD Highly selective tripeptide thrombin inhibitors. J Med Chem36:314-9 (1993) Prothrombin
Name:Prothrombin
Type:Protein
Mol. Mass.:70029.57
Organism:Homo sapiens (Human)
Description:P00734
Residue:622
BDBM50046358
NameBDBM50046358
Synonyms:CHEMBL110780 | {2-[2-(1-Formyl-4-guanidino-butylcarbamoyl)-pyrrolidin-1-yl]-1-naphthalen-2-yl-2-oxo-ethyl}-carbamic acid tert-butyl ester
TypeSmall organic molecule
Emp. Form.C28H38N6O5
Mol. Mass.538.6385
SMILESCC(C)(C)OC(=O)N[C@@H](C(=O)N1CCC[C@H]1C(=O)NC(CCCNC(N)=N)C=O)c1ccc2ccccc2c1