Reaction Details
TargetProthrombin
LigandBDBM50046367
Substrate/Competitorn/a
Meas. Tech.ChEMBL_208855 (CHEMBL816690)
IC50 16000±n/a nM
Citation Shuman, RTRothenberger, RBCampbell, CSSmith, GFGifford-Moore, DSGesellchen, PD Highly selective tripeptide thrombin inhibitors. J Med Chem36:314-9 (1993) Prothrombin
Name:Prothrombin
Type:Protein
Mol. Mass.:70029.57
Organism:Homo sapiens (Human)
Description:P00734
Residue:622
BDBM50046367
NameBDBM50046367
Synonyms:CHEMBL321322 | [2-[2-(1-Formyl-4-guanidino-butylcarbamoyl)-pyrrolidin-1-yl]-1-(4-hydroxy-phenyl)-2-oxo-ethyl]-carbamic acid tert-butyl ester
TypeSmall organic molecule
Emp. Form.C24H36N6O6
Mol. Mass.504.5792
SMILES[#6]C([#6])([#6])[#8]-[#6](=O)-[#7]-[#6@@H](-[#6](=O)-[#7]-1-[#6]-[#6]-[#6]-[#6@H]-1-[#6](=O)-[#7]-[#6@@H](-[#6]-[#6]-[#6]\[#7]=[#6](/[#7])-[#7])-[#6]=O)-c1ccc(-[#8])cc1