Reaction Details
TargetNeuropeptide Y receptor type 2
LigandBDBM50046551
Substrate/Competitorn/a
Meas. Tech.ChEMBL_144149 (CHEMBL750764)
Ki 0.3±n/a nM
Citation Kirby, DAKoerber, SCCraig, AGFeinstein, RDDelmas, LBrown, MRRivier, JE Defining structural requirements for neuropeptide Y receptors using truncated and conformationally restricted analogues. J Med Chem36:385-93 (1993) Neuropeptide Y receptor type 2
Name:Neuropeptide Y receptor type 2
Type:Enzyme Catalytic Domain
Mol. Mass.:42734.65
Organism:Homo sapiens (Human)
Description:NPY-Y2 NPY2R HUMAN::P49146
Residue:381
BDBM50046551
NameBDBM50046551
Synonyms:CHEMBL2370625 | Tyr-c(Glu-Ser-Lys-Pro-Gly-Arg-His-(DDpr))-Ile-Asn-Leu-Ile-Thr-Arg-Gln-Arg-Tyr
TypeSmall organic molecule
Emp. Form.C98H157N33O26
Mol. Mass.2213.5007
SMILES[H][C@@]12CCCN1C(=O)[C@H](CCCCN)NC(=O)[C@H](CO)NC(=O)[C@H](CCC(=O)N[C@@H](CNC(=O)[C@@H](Cc1c[nH]cn1)NC(=O)[C@H](CCCN=C(N)N)NC(=O)[C@@H](C)NC2=O)C(=O)N[C@@H]([C@@H](C)CC)C(=O)N[C@@H](CC(N)=O)C(=O)N[C@@H](CC(C)C)C(=O)N[C@@H]([C@@H](C)CC)C(=O)N[C@@H]([C@@H](C)O)C(=O)N[C@@H](CCCN=C(N)N)C(=O)N[C@@H](CCC(N)=O)C(=O)N[C@@H](CCCN=C(N)N)C(=O)N[C@@H](Cc1ccc(O)cc1)C(O)=O)NC(=O)[C@@H](N)Cc1ccc(O)cc1