Reaction Details
TargetLanosterol 14-alpha demethylase
LigandBDBM50046561
Substrate/Competitorn/a
Meas. Tech.ChEMBL_147857 (CHEMBL754769)
IC50 9100±n/a nM
Citation Frye, LLCusack, KPLeonard, DA 32-Methyl-32-oxylanosterols: dual-action inhibitors of cholesterol biosynthesis. J Med Chem36:410-6 (1993) Lanosterol 14-alpha demethylase
Name:Lanosterol 14-alpha demethylase
Type:PROTEIN
Mol. Mass.:56717.47
Organism:Rattus norvegicus
Description:ChEMBL_52075
Residue:503
BDBM50046561
NameBDBM50046561
Synonyms:1-[17-(1,5-Dimethyl-hexyl)-3-hydroxy-4,4,10,13-tetramethyl-1,2,3,4,5,6,9,10,11,12,13,15,16,17-tetradecahydro-cyclopenta[a]phenanthren-14-yl]-ethanone | CHEMBL133434
TypeSmall organic molecule
Emp. Form.C31H52O2
Mol. Mass.456.7434
SMILESCC(C)CCC[C@@H](C)[C@H]1CC[C@@]2(C(C)=O)C3=CCC4C(C)(C)[C@@H](O)CC[C@]4(C)C3CC[C@]12C