Reaction Details
TargetRenin
LigandBDBM50046786
Substrate/Competitorn/a
Meas. Tech.ChEMBL_195746 (CHEMBL801598)
pH7.4±n/a
IC50 5.4±n/a nM
Commentsextracted
Citation Rosenberg, SHSpina, KPWoods, KWPolakowski, JMartin, DLYao, ZStein, HHCohen, JBarlow, JLEgan, DA Studies directed toward the design of orally active renin inhibitors. 1. Some factors influencing the absorption of small peptides. J Med Chem36:449-59 (1993) Renin
Name:Renin
Type:Enzyme
Mol. Mass.:45058.99
Organism:Homo sapiens (Human)
Description:n/a
Residue:406
BDBM50046786
NameBDBM50046786
Synonyms:2-Benzyl-N-[1-(1-cyclohexylmethyl-2,3-dihydroxy-5-methyl-hexylcarbamoyl)-2-(1H-imidazol-4-yl)-ethyl]-4-(4-methyl-piperazin-1-yl)-4-oxo-butyramide | CHEMBL139813
TypeSmall organic molecule
Emp. Form.C36H56N6O5
Mol. Mass.652.867
SMILESCC(C)C[C@H](O)[C@H](O)[C@H](CC1CCCCC1)NC(=O)[C@H](Cc1cnc[nH]1)NC(=O)[C@@H](CC(=O)N1CCN(C)CC1)Cc1ccccc1