Reaction Details
TargetRenin
LigandBDBM50046802
Substrate/Competitorn/a
Meas. Tech.ChEMBL_195959 (CHEMBL879242)
pH7.4±n/a
IC50 0.8±n/a nM
Commentsextracted
Citation Rosenberg, SHSpina, KPCondon, SLPolakowski, JYao, ZKovar, PStein, HHCohen, JBarlow, JLKlinghofer, V Studies directed toward the design of orally active renin inhibitors. 2. Development of the efficacious, bioavailable renin inhibitor (2S)-2-benzyl-3- [[(1-methylpiperazin-4-yl)sulfonyl]propionyl]-3-thiazol-4-yl-L-alanine amide of (2S,3R,4S)-2-amino-1-cyclohexyl-3,4-dihydroxy-6-methylheptane (A-725 J Med Chem36:460-7 (1993) Renin
Name:Renin
Type:Enzyme
Mol. Mass.:45058.99
Organism:Homo sapiens (Human)
Description:n/a
Residue:406
BDBM50046802
NameBDBM50046802
Synonyms:2-Benzyl-N*1*-[1-(1-cyclohexylmethyl-2,3-dihydroxy-5-methyl-hexylcarbamoyl)-2-(1H-imidazol-4-yl)-ethyl]-N*4*-[2-(2-methoxy-ethoxymethoxy)-ethyl]-N*4*-methyl-succinamide | CHEMBL143427
TypeSmall organic molecule
Emp. Form.C38H61N5O8
Mol. Mass.715.9196
SMILESCOCCOCOCCN(C)C(=O)C[C@@H](Cc1ccccc1)C(=O)N[C@@H](Cc1cnc[nH]1)C(=O)N[C@@H](CC1CCCCC1)[C@@H](O)[C@@H](O)CC(C)C