Reaction Details
TargetThromboxane A2 receptor
LigandBDBM50047068
Substrate/Competitorn/a
Meas. Tech.ChEMBL_207650 (CHEMBL811632)
Ki 6±n/a nM
Citation Nicolaï, EGoyard, JBenchetrit, TTeulon, JMCaussade, FVirone, ADelchambre, CCloarec, A Synthesis and structure-activity relationships of novel benzimidazole and imidazo[4,5-b]pyridine acid derivatives as thromboxane A2 receptor antagonists. J Med Chem36:1175-87 (1993) Thromboxane A2 receptor
Name:Thromboxane A2 receptor
Type:Enyzme
Mol. Mass.:37445.28
Organism:Homo sapiens (Human)
Description:P21731
Residue:343
BDBM50047068
NameBDBM50047068
Synonyms:4-[5-Chloro-1-(4-methylsulfanyl-benzyl)-1H-benzoimidazol-2-yl]-3,3-dimethyl-butyric acid | CHEMBL18000
TypeSmall organic molecule
Emp. Form.C21H23ClN2O2S
Mol. Mass.402.938
SMILESCSc1ccc(Cn2c(CC(C)(C)CC(O)=O)nc3cc(Cl)ccc23)cc1