Reaction Details
TargetSodium-dependent serotonin transporter
LigandBDBM50047103
Substrate/Competitorn/a
Meas. Tech.ChEMBL_198045 (CHEMBL804187)
IC50 0.2±n/a nM
Citation Malleron, JLGuérémy, CMignani, SPeyronel, JFTruchon, ABlanchard, JCDoble, ALaduron, PPiot, OZundel, JL New indole derivatives as potent and selective serotonin uptake inhibitors. J Med Chem36:1194-202 (1993) Sodium-dependent serotonin transporter
Name:Sodium-dependent serotonin transporter
Type:Multi-pass membrane protein
Mol. Mass.:70168.43
Organism:Rattus norvegicus (rat)
Description:P31652
Residue:630
BDBM50047103
NameBDBM50047103
Synonyms:2-{3-[4-(1H-Indol-3-yl)-3,6-dihydro-2H-pyridin-1-yl]-propyl}-2H-naphtho[1,8-cd]isothiazole 1,1-dioxide | CHEMBL19613
TypeSmall organic molecule
Emp. Form.C26H25N3O2S
Mol. Mass.443.561
SMILESO=S1(=O)N(CCCN2CCC(=CC2)c2c[nH]c3ccccc23)c2cccc3cccc1c23